{"text_format":"1","workbook":"xlsx","n_sheets":3,"sheets":["Domande","Risposte Possibili","Template"],"not_rendered":{"charts":0,"images":0,"macros":1,"external_links":0,"defined_names":0,"comments":0,"pivot_tables":0},"unopened":[],"bounds":{"document_bytes":16777216,"sheet_cells":100000,"rows_first":2000,"rows_last":500,"rows_between":2000,"halvings":0,"cell_chars":16384,"cell_head_chars":4096},"cells_cut":0,"cells_raw":0,"read":"whole","date_system":"1900"}

{"sheet":"Domande","index":0,"n_rows":22,"n_cols":4,"rows_kept":22,"cut":false,"hidden":false,"merged":[[15,1,17,1],[20,1,21,1],[0,0,0,1]]}
["Questo Tool vi permette di identificare il Template piu' adatto, alla vostra organizzazione e dimensione, per la redazione/aggiornamento del Piano Strategico triennale dei Sistemi Informativi, come da Direttiva AgID.\nRispondendo a queste 5 semplici domande (selezionando le risposte nelle caselle gialle) vi sarà indicato \"cosa fare\" ed il codice del Template da \"scaricare\" tramite il link indicato nella stessa pagina WEB dalla quale avete scaricato il presente tool.\nPer una corretta identificazione del modello rispondere a tutte le domande."]
["Domanda","Risposta ","Classe","Indicazione"]
["Hai già redatto un piano dei sistemi informativi secondo direttiva Agid, se si per quale triennio?","Anni 2020-2022",{"$f":"IF(B3='Risposte Possibili'!D2,0,IF(B3='Risposte Possibili'!D3,1,IF(B3='Risposte Possibili'!D4,1,IF(B3='Risposte Possibili'!D5,1,IF(B3='Risposte Possibili'!D6,4,\"\")))))","v":1},{"$f":"IF(C3=0,\"Piano da emettere\",IF(C3<>4,\"Aggiornamento Necessario\",\"Piano in linea con direttive\"))","v":"Aggiornamento Necessario"}]
["Quanti Abitanti ha il tuo comune?","da 1 a 1.000",{"$f":"IF(B4='Risposte Possibili'!A2,0,IF(B4='Risposte Possibili'!A3,1,IF(B4='Risposte Possibili'!A4,2,IF(B4='Risposte Possibili'!A5,3,IF(B4='Risposte Possibili'!A6,4,IF(B4='Risposte Possibili'!A7,5,IF(B4='Risposte Possibili'!A8,6,7)))))))","v":0},{"$f":"IF(C4<3,\"Versione Ridotta 1\",\"Versione Completa 1\")","v":"Versione Ridotta 1"}]
["Quanti addetti ci sono ai sitemi informativi?","da 1 a 3",{"$f":"IF(B5='Risposte Possibili'!B2,0,IF(B5='Risposte Possibili'!B3,1,IF(B5='Risposte Possibili'!B4,2,IF(B5='Risposte Possibili'!B5,3,4))))","v":0},{"$f":"IF(C5<2,\"Versione Ridotta 2\",\"Versione Completa 2\")","v":"Versione Ridotta 2"}]
["Quanti utenti ha il tuo sistema informativo?","meno di 5",{"$f":"IF(B6='Risposte Possibili'!C2,0,IF(B6='Risposte Possibili'!C3,0,IF(B6='Risposte Possibili'!C4,0,IF(B6='Risposte Possibili'!C5,2,3))))","v":0},{"$f":"IF(C6<2,\"Versione Ridotta 3\",\"Versione Completa 3\")","v":"Versione Ridotta 3"}]
["Hai sviluppato, o fatto sviluppare il tuo  Sistema Informativo (quello prevalente) \"ad hoc\", non utilizzando soluzioni di mercato?","NO",{"$f":"IF(B7='Risposte Possibili'!E2,0,1)","v":0},{"$f":"IF(C7<1,\"Versione Ridotta 4\",\"Versione Completa 4\")","v":"Versione Ridotta 4"}]
[null,null,{"$f":"SUM(C3:C7)","v":1}]
[]
["Indicazione","Template"]
["Se Classe e' pari a tutti 0 --->","Template M1"]
["Se Piano da Emettere --->","Template Possibili C1 ed R1"]
["Aggiornamento necessario Classe 1 --->","Aggiornare piano in essere"]
["Aggiornamento necessario Classe 2 --->","Aggiornare piano in essere"]
["Versione Completa 4 --->","Template tipo C1"]
["Versione ridotta 1","Template tipo R1"]
["Versione ridotta 2"]
["Versione ridotta 3"]
["Cersione Completa 1 o Versione Completa2 o Versione Completa 3 ","Template tipo C1"]
[{"$f":"IF(C3=0,\"Piano da definire e pubblicare\",IF(C3=4,\"Piano in linea con periodo definito da AgID, verificare se pubblicato sul sito istituzionale\",IF(OR(C3=1,C3=2,C3=3)=TRUE,\"Piano da aggiornare e pubblicare\",\"\")))","v":"Piano da aggiornare e pubblicare"},"Attività da svolgere",81958]
[{"$f":"IF(C3=0,\"Utilizzare Form STD AgID o in alternativa quello qui sotto indicato\",IF(C3=3,\"Verificare che il piano sia completo secondo le direttive AgID\",IF(OR(C3=2,C3=1)=TRUE,\"Utilizzare il piano già emesso per effettuare gli aggiornamenti, se si vuole conoscere il modello suggerito rispondere a tutte le domande, alla prima rispondere NO.\",\"\")))","v":"Utilizzare il piano già emesso per effettuare gli aggiornamenti, se si vuole conoscere il modello suggerito rispondere a tutte le domande, alla prima rispondere NO."},"Modello suggerito"]
[{"$f":"IF(C3=0,IF(C8=0,\"Modello M1\",IF(OR(D4= \"Versione Completa 1\",D5= \"Versione Completa 2\",D6= \"Versione Completa 3\",D7= \"Versione Completa 4\")= TRUE,\"Modello C1\",\"Modello R1\")),\"\")","v":""}]

{"sheet":"Risposte Possibili","index":1,"n_rows":8,"n_cols":6,"rows_kept":8,"cut":false,"hidden":false,"merged":[]}
["Abitanti","Addetti","Utenti","Piano","pacchetti","soluzioni in house"]
["da 1 a 1.000","da 1 a 3","meno di 5","NO","NO","NO"]
["da 1.001 a 3000","da 4 a 5 ","da 5 a 10","Anni 2020-2022","SI","SI"]
["da 3.001 e 10.000","da 6 a 10","da 11 a 20","Anni 2021-2023"]
["da 10.001 a 30.000","oltre 10","da 21 a 50","Anni 2022-2024"]
["da 30.001 a 40.000",null,"oltre 50 ","Anni 2024-2026"]
["da 40.001 a 100.000"]
["Oltre 100.000"]

{"sheet":"Template","index":2,"n_rows":7,"n_cols":2,"rows_kept":7,"cut":false,"hidden":true,"merged":[]}
["Codice Template","Descrizione"]
["C1","Template Completo Agid con tutte linee di azione per tutti gli anni"]
["R1","Template Ridotto con tutte linee di azione valide per tutti gli anni"]
["M1","Template Minimo (per piccoli enti e piccoli comuni)"]
["C","Template Agid "]
["A1","Template  Agid 1° aggiornamento"]
["A2","Template Agid 2° aggiornamento "]